Target
Membrane primary amine oxidase
Ligand
BDBM50104436
Substrate
Meas. Tech.
ChEBML_200170
Ki
2700±n/a nM
Citation
 Conn, CShimmon, RCordaro, FHargraves, TLIbrahim, P Combinatorial synthesis of SSAO inhibitors using sonogashira coupling: SAR of aryl propargylic amines. Bioorg Med Chem Lett 11:2565-8 (2001)  
Target
Name:
Membrane primary amine oxidase
Synonyms:
AOC3_RAT Aoc3 Vascular adhesion protein 1 (VAP-1)
Type:
Enzyme
Mol. Mass.:
84979.78
Organism:
Rattus norvegicus (Rat)
Description:
O08590
Residue:
763
  
Inhibitor
Name:
BDBM50104436
Synonyms:
((E)-3-Benzo[1,3]dioxol-5-yl-allyl)-methyl-amine | CHEMBL313229
Type:
Small organic molecule
Emp. Form.:
C11H13NO2
Mol. Mass.:
191.2264
SMILES:
CNC\C=C\c1ccc2OCOc2c1
: