Target
M-phase inducer phosphatase 2
Ligand
BDBM50104677
Substrate
Meas. Tech.
ChEMBL_49038 (CHEMBL662076)
IC50
1100±n/a nM
Citation
 Sodeoka, MSampe, RKojima, SBaba, YUsui, TUeda, KOsada, H Synthesis of a tetronic acid library focused on inhibitors of tyrosine and dual-specificity protein phosphatases and its evaluation regarding VHR and cdc25B inhibition. J Med Chem 44:3216-22 (2001)  
Target
Name:
M-phase inducer phosphatase 2
Synonyms:
Cdc25b Dual specificity phosphatase Cdc25B MPIP2_MOUSE
Type:
PROTEIN
Mol. Mass.:
65485.87
Organism:
Mus musculus
Description:
ChEMBL_49038
Residue:
576
  
Inhibitor
Name:
BDBM50104677
Synonyms:
3-Hexadecanoyl-4-hydroxy-5-methylene-5H-furan-2-one | CHEMBL110642
Type:
Small organic molecule
Emp. Form.:
C21H34O4
Mol. Mass.:
350.4923
SMILES:
CCCCCCCCCCCCCCCC(=O)C1C(=O)OC(=C)C1=O
: