Target
Macrophage metalloelastase
Ligand
BDBM50104723
Substrate
Meas. Tech.
ChEMBL_106458 (CHEMBL719130)
Ki
200±n/a nM
Citation
 Schröder, JHenke, AWenzel, HBrandstetter, HStammler, HGStammler, APfeiffer, WDTschesche, H Structure-based design and synthesis of potent matrix metalloproteinase inhibitors derived from a 6H-1,3,4-thiadiazine scaffold. J Med Chem 44:3231-43 (2001)  
Target
Name:
Macrophage metalloelastase
Synonyms:
HME MMP12_HUMAN Matrix metalloproteinase-12 (MMP 12) Matrix metalloproteinase-12 (MMP12) | Matrix metalloproteinases 12 (MMP-12)
Type:
Enzyme
Mol. Mass.:
54012.99
Organism:
Homo sapiens (Human)
Description:
P39900
Residue:
470
  
Inhibitor
Name:
BDBM50104723
Synonyms:
2-Benzenesulfonylamino-N-[5-(4-chloro-phenyl)-6H-[1,3,4]thiadiazin-2-yl]-2-methyl-propionamide | CHEMBL109806
Type:
Small organic molecule
Emp. Form.:
C19H19ClN4O3S2
Mol. Mass.:
450.962
SMILES:
CC(C)(NS(=O)(=O)c1ccccc1)C(=O)NC1=NN=C(CS1)c1ccc(Cl)cc1
: