Target
Sodium/hydrogen exchanger 5
Ligand
BDBM50058715
Substrate
Meas. Tech.
ChEMBL_141051 (CHEMBL748619)
IC50
>30000±n/a nM
Citation
 Ahmad, SDoweyko, LMDugar, SGrazier, NNgu, KWu, SCYost, KJChen, BCGougoutas, JZDiMarco, JDLan, SJGavin, BJChen, AYDorso, CRSerafino, RKirby, MAtwal, KS Arylcyclopropanecarboxyl guanidines as novel, potent, and selective inhibitors of the sodium hydrogen exchanger isoform-1. J Med Chem 44:3302-10 (2001)  
Target
Name:
Sodium/hydrogen exchanger 5
Synonyms:
NHE5 SLC9A5
Type:
PROTEIN
Mol. Mass.:
99022.39
Organism:
Homo sapiens (Human)
Description:
ChEMBL_141051
Residue:
896
  
Inhibitor
Name:
BDBM50058715
Synonyms:
CHEMBL64360 ENIPORIDE N-(5-Methanesulfonyl-2-methyl-4-pyrrol-1-yl-benzoyl)-guanidine (Eniporide, EMD-96-875) | N-(diaminomethylene)-2-methyl-5-(methylsulfonyl)-4-(1H-pyrrol-1-yl)benzamide
Type:
Small organic molecule
Emp. Form.:
C14H16N4O3S
Mol. Mass.:
320.367
SMILES:
Cc1cc(c(cc1C(=O)NC(N)=N)S(C)(=O)=O)-n1cccc1
: