Target
Sodium/hydrogen exchanger 5
Ligand
BDBM50058759
Substrate
Meas. Tech.
ChEMBL_141051 (CHEMBL748619)
IC50
>30000±n/a nM
Citation
 Ahmad, SDoweyko, LMDugar, SGrazier, NNgu, KWu, SCYost, KJChen, BCGougoutas, JZDiMarco, JDLan, SJGavin, BJChen, AYDorso, CRSerafino, RKirby, MAtwal, KS Arylcyclopropanecarboxyl guanidines as novel, potent, and selective inhibitors of the sodium hydrogen exchanger isoform-1. J Med Chem 44:3302-10 (2001)  
Target
Name:
Sodium/hydrogen exchanger 5
Synonyms:
NHE5 SLC9A5
Type:
PROTEIN
Mol. Mass.:
99022.39
Organism:
Homo sapiens (Human)
Description:
ChEMBL_141051
Residue:
896
  
Inhibitor
Name:
BDBM50058759
Synonyms:
CHEMBL436559 Cariporide N-(4-Isopropyl-3-methanesulfonyl-benzoyl)-guanidine(Cariporide) N-(diaminomethylene)-4-isopropyl-3-(methylsulfonyl)benzamide
Type:
Small organic molecule
Emp. Form.:
C12H17N3O3S
Mol. Mass.:
283.347
SMILES:
CC(C)c1ccc(cc1S(C)(=O)=O)C(=O)NC(N)=N
: