Target
Aldehyde dehydrogenase, mitochondrial
Ligand
BDBM50093534
Substrate
Meas. Tech.
ChEMBL_31176 (CHEMBL641141)
IC50
50±n/a nM
Citation
 Gao, GYLi, DJKeung, WM Synthesis of potential antidipsotropic isoflavones: inhibitors of the mitochondrial monoamine oxidase-aldehyde dehydrogenase pathway. J Med Chem 44:3320-8 (2001)  
Target
Name:
Aldehyde dehydrogenase, mitochondrial
Synonyms:
ALDH class 2 ALDH2 ALDHI Aldehyde dehydrogenase (ALDH2)
Type:
Enzyme
Mol. Mass.:
56382.67
Organism:
Homo sapiens (Human)
Description:
P05091
Residue:
517
  
Inhibitor
Name:
BDBM50093534
Synonyms:
7-[3-(4-Hydroxy-phenyl)-4-oxo-4H-chromen-7-yloxy]-heptanoic acid | CHEMBL112007
Type:
Small organic molecule
Emp. Form.:
C22H22O6
Mol. Mass.:
382.4065
SMILES:
OC(=O)CCCCCCOc1ccc2c(c1)occ(-c1ccc(O)cc1)c2=O
: