Target
Interstitial collagenase
Ligand
BDBM50104969
Substrate
Meas. Tech.
ChEMBL_106142 (CHEMBL718689)
Ki
<1±n/a nM
Citation
 Yao, WWasserman, ZRChao, MReddy, GShi, ELiu, RQCovington, MBArner, ECPratta, MATortorella, MMagolda, RLNewton, RQian, MRibadeneira, MDChrist, DWexler, RRDecicco, CP Design and synthesis of a series of (2R)-N(4)-hydroxy-2-(3-hydroxybenzyl)-N(1)- [(1S,2R)-2-hydroxy-2,3-dihydro-1H-inden-1-yl]butanediamide derivatives as potent, selective, and orally bioavailable aggrecanase inhibitors. J Med Chem 44:3347-50 (2001)  
Target
Name:
Interstitial collagenase
Synonyms:
CLG MMP1 Matrix metalloproteinase-1 | Matrix metalloproteinase-1 (MMP-1)
Type:
Enzyme
Mol. Mass.:
54010.26
Organism:
Homo sapiens (Human)
Description:
P03956
Residue:
469
  
Inhibitor
Name:
BDBM50104969
Synonyms:
(R)-N*4*-Hydroxy-2-isobutyl-N*1*-[(S)-2-(4-methoxy-phenyl)-1-methylcarbamoyl-ethyl]-succinamide N*4*-Hydroxy-2-isobutyl-N*1*-[2-(4-methoxy-phenyl)-1-methylcarbamoyl-ethyl]-succinamide SC-44463
Type:
Small organic molecule
Emp. Form.:
C19H29N3O5
Mol. Mass.:
379.4507
SMILES:
CNC(=O)[C@H](Cc1ccc(OC)cc1)NC(=O)[C@H](CC(C)C)CC(=O)NO
: