Target
Neutrophil collagenase
Ligand
BDBM50104976
Substrate
Meas. Tech.
ChEMBL_105199 (CHEMBL713838)
Ki
272±n/a nM
Citation
 Xue, CBHe, XCorbett, RLRoderick, JWasserman, ZRLiu, RQJaffee, BDCovington, MBQian, MTrzaskos, JMNewton, RCMagolda, RLWexler, RRDecicco, CP Discovery of macrocyclic hydroxamic acids containing biphenylmethyl derivatives at P1', a series of selective TNF-alpha converting enzyme inhibitors with potent cellular activity in the inhibition of TNF-alpha release. J Med Chem 44:3351-4 (2001)  
Target
Name:
Neutrophil collagenase
Synonyms:
CLG1 MMP8 Matrix metalloproteinase-8 PMNL collagenase | PMNL-CL
Type:
Enzyme
Mol. Mass.:
53413.48
Organism:
Homo sapiens (Human)
Description:
P22894
Residue:
467
  
Inhibitor
Name:
BDBM50104976
Synonyms:
11-(3',5'-Bis-trifluoromethyl-biphenyl-4-ylmethyl)-2,10-dioxo-1-oxa-3,9-diaza-cyclopentadecane-8,12-dicarboxylic acid 12-hydroxyamide 8-[(2-oxo-2-piperazin-1-yl-ethyl)-amide] | CHEMBL114878
Type:
Small organic molecule
Emp. Form.:
C35H42F6N6O7
Mol. Mass.:
772.7344
SMILES:
ONC(=O)[C@H]1CCCOC(=O)NCCCC[C@H](NC(=O)[C@@H]1Cc1ccc(cc1)-c1cc(cc(c1)C(F)(F)F)C(F)(F)F)C(=O)NCC(=O)N1CCNCC1
: