Target
Matrix metalloproteinase-15
Ligand
BDBM50104974
Substrate
Meas. Tech.
ChEMBL_106794 (CHEMBL718400)
Ki
>2000±n/a nM
Citation
 Xue, CBHe, XCorbett, RLRoderick, JWasserman, ZRLiu, RQJaffee, BDCovington, MBQian, MTrzaskos, JMNewton, RCMagolda, RLWexler, RRDecicco, CP Discovery of macrocyclic hydroxamic acids containing biphenylmethyl derivatives at P1', a series of selective TNF-alpha converting enzyme inhibitors with potent cellular activity in the inhibition of TNF-alpha release. J Med Chem 44:3351-4 (2001)  
Target
Name:
Matrix metalloproteinase-15
Synonyms:
MMP-15 MMP15_HUMAN MT2-MMP MTMMP2 Matrix metalloproteinase-15 Membrane-type-2 matrix metalloproteinase | SMCP-2
Type:
PROTEIN
Mol. Mass.:
75814.08
Organism:
Homo sapiens (Human)
Description:
ChEMBL_106793
Residue:
669
  
Inhibitor
Name:
BDBM50104974
Synonyms:
2,10-Dioxo-11-(2'-trifluoromethyl-biphenyl-4-ylmethyl)-1-oxa-3,9-diaza-cyclopentadecane-8,12-dicarboxylic acid 8-carbamoylmethyl-amide 12-hydroxyamide | CHEMBL115263
Type:
Small organic molecule
Emp. Form.:
C30H36F3N5O7
Mol. Mass.:
635.6313
SMILES:
NC(=O)CNC(=O)[C@@H]1CCCCNC(=O)OCCC[C@@H]([C@@H](Cc2ccc(cc2)-c2ccccc2C(F)(F)F)C(=O)N1)C(=O)NO
: