Target
Vascular cell adhesion protein 1
Ligand
BDBM50105151
Substrate
Meas. Tech.
ChEMBL_213809 (CHEMBL818854)
IC50
>6±n/a nM
Citation
 Zhu, GDArendsen, DLGunawardana, IWBoyd, SAStewart, AOFry, DGCool, BLKifle, LSchaefer, VMeuth, JMarsh, KCKempf-Grote, AJKilgannon, PGallatin, WMOkasinski, GF Selective inhibition of ICAM-1 and E-selectin expression in human endothelial cells. 2. Aryl modifications of 4-(aryloxy)thieno[2,3-c]pyridines with fine-tuning at C-2 carbamides. J Med Chem 44:3469-87 (2001)  
Target
Name:
Vascular cell adhesion protein 1
Synonyms:
CD106 antigen VCAM-1 VCAM1_HUMAN Vascular cell adhesion protein 1 (VCAM-1) | Vascular cell adhesion protein 1 precursor
Type:
Other Protein Type
Mol. Mass.:
81259.16
Organism:
Homo sapiens (Human)
Description:
P19320
Residue:
739
  
Inhibitor
Name:
BDBM50105151
Synonyms:
4-(4-Vinyl-phenoxy)-thieno[2,3-c]pyridine-2-carboxylic acid amide | CHEMBL119733
Type:
Small organic molecule
Emp. Form.:
C16H12N2O2S
Mol. Mass.:
296.344
SMILES:
NC(=O)c1cc2c(Oc3ccc(C=C)cc3)cncc2s1
: