Target
Calpain-1 catalytic subunit
Ligand
BDBM50105236
Substrate
Meas. Tech.
ChEMBL_43496 (CHEMBL877099)
IC50
5±n/a nM
Citation
 Wells, GJTao, MJosef, KABihovsky, R 1,2-Benzothiazine 1,1-dioxide P(2)-P(3) peptide mimetic aldehyde calpain I inhibitors. J Med Chem 44:3488-503 (2001)  
Target
Name:
Calpain-1 catalytic subunit
Synonyms:
CAN1_HUMAN CAPN1 Calpain-1 (u-Calpain) Calpain1
Type:
Protein
Mol. Mass.:
81880.51
Organism:
Homo sapiens (Human)
Description:
Residue:
714
  
Inhibitor
Name:
BDBM50105236
Synonyms:
6-Chloro-2-methyl-1,1-dioxo-1,2,3,4-tetrahydro-1lambda*6*-benzo[e][1,2]thiazine-3-carboxylic acid (1-benzyl-2-oxo-ethyl)-amide | CHEMBL117553
Type:
Small organic molecule
Emp. Form.:
C19H19ClN2O4S
Mol. Mass.:
406.883
SMILES:
CN1C(Cc2cc(Cl)ccc2S1(=O)=O)C(=O)N[C@@H](Cc1ccccc1)C=O
: