Target
Prostaglandin G/H synthase 1
Ligand
BDBM50105293
Substrate
Meas. Tech.
ChEBML_159271
IC50
1500±n/a nM
Citation
 Feixas, JJiménez, JMGodessart, NPuig, CSoca, LCrespo, MI Naphthalene derivatives: A new series of selective cyclooxygenase-2 inhibitors. Bioorg Med Chem Lett 11:2687-90 (2001)  
Target
Name:
Prostaglandin G/H synthase 1
Synonyms:
Cox-1 Cyclooxygenase PGH1_RAT Ptgs1
Type:
Enzyme Catalytic Domain
Mol. Mass.:
69033.56
Organism:
RAT
Description:
COX-1 0 RAT::Q63921
Residue:
602
  
Inhibitor
Name:
BDBM50105293
Synonyms:
2-(4-Benzyl-7-methoxy-naphthalen-1-yl)-propionic acid | CHEMBL90127
Type:
Small organic molecule
Emp. Form.:
C21H20O3
Mol. Mass.:
320.3817
SMILES:
COc1ccc2c(Cc3ccccc3)ccc(C(C)C(O)=O)c2c1
: