Target
Amine oxidase [flavin-containing] B
Ligand
BDBM50105418
Substrate
Meas. Tech.
ChEBML_123926
IC50
77±n/a nM
Citation
 Ling, LUrichuk, LJSloley, BDCoutts, RTBaker, GBShan, JJPang, PK Synthesis of N-propargylphenelzine and analogues as neuroprotective agents. Bioorg Med Chem Lett 11:2715-7 (2001)  
Target
Name:
Amine oxidase [flavin-containing] B
Synonyms:
AOFB_RAT Amine oxidase [flavin-containing] B Monoamine Oxidase Type B (MAO-B) Monoamine oxidase B (MAO-B) Monoamine oxidase type B (MAOB) | Monoamine oxidase-B (MAO-B)
Type:
Enzyme
Mol. Mass.:
58469.65
Organism:
Rattus norvegicus (rat)
Description:
P19643
Residue:
520
  
Inhibitor
Name:
BDBM50105418
Synonyms:
CHEMBL90144 | N-Phenethyl-N-prop-2-ynyl-hydrazine
Type:
Small organic molecule
Emp. Form.:
C11H14N2
Mol. Mass.:
174.2423
SMILES:
NN(CCc1ccccc1)CC#C
: