Target
Histone deacetylase 1
Ligand
BDBM50105693
Substrate
Meas. Tech.
ChEMBL_87851 (CHEMBL701991)
IC50
800±n/a nM
Citation
 Lavoie, RBouchain, GFrechette, SWoo, SHAbou-Khalil, ELeit, SFournel, MYan, PTTrachy-Bourget, MCBeaulieu, CLi, ZBesterman, JDelorme, D Design and synthesis of a novel class of histone deacetylase inhibitors. Bioorg Med Chem Lett 11:2847-50 (2001)  
Target
Name:
Histone deacetylase 1
Synonyms:
Cereblon/Histone deacetylase 1 HDAC1 Histone deacetylase 1 (HDAC1) RPD3L1
Type:
Enzyme
Mol. Mass.:
55090.27
Organism:
Homo sapiens (Human)
Description:
Q13547
Residue:
482
  
Inhibitor
Name:
BDBM50105693
Synonyms:
(E)-N-Hydroxy-3-[4-(4-sulfamoyl-benzenesulfonylamino)-phenyl]-acrylamide US8796330, 102
Type:
Small organic molecule
Emp. Form.:
C15H15N3O6S2
Mol. Mass.:
397.426
SMILES:
NS(=O)(=O)c1ccc(cc1)S(=O)(=O)Nc1ccc(\C=C\C(=O)NO)cc1
: