Target
Histone deacetylase 1
Ligand
BDBM50105691
Substrate
Meas. Tech.
ChEMBL_205835 (CHEMBL810946)
EC50
5000±n/a nM
Citation
 Lavoie, RBouchain, GFrechette, SWoo, SHAbou-Khalil, ELeit, SFournel, MYan, PTTrachy-Bourget, MCBeaulieu, CLi, ZBesterman, JDelorme, D Design and synthesis of a novel class of histone deacetylase inhibitors. Bioorg Med Chem Lett 11:2847-50 (2001)  
Target
Name:
Histone deacetylase 1
Synonyms:
Cereblon/Histone deacetylase 1 HDAC1 Histone deacetylase 1 (HDAC1) RPD3L1
Type:
Enzyme
Mol. Mass.:
55090.27
Organism:
Homo sapiens (Human)
Description:
Q13547
Residue:
482
  
Inhibitor
Name:
BDBM50105691
Synonyms:
(E)-3-(4-Benzenesulfonylamino-phenyl)-N-hydroxy-acrylamide CHEMBL317814 US8796330, 36
Type:
Small organic molecule
Emp. Form.:
C15H14N2O4S
Mol. Mass.:
318.348
SMILES:
ONC(=O)\C=C\c1ccc(NS(=O)(=O)c2ccccc2)cc1
: