Target
Histone deacetylase 1
Ligand
BDBM50105684
Substrate
Meas. Tech.
ChEMBL_205835 (CHEMBL810946)
EC50
5000±n/a nM
Citation
 Lavoie, RBouchain, GFrechette, SWoo, SHAbou-Khalil, ELeit, SFournel, MYan, PTTrachy-Bourget, MCBeaulieu, CLi, ZBesterman, JDelorme, D Design and synthesis of a novel class of histone deacetylase inhibitors. Bioorg Med Chem Lett 11:2847-50 (2001)  
Target
Name:
Histone deacetylase 1
Synonyms:
Cereblon/Histone deacetylase 1 HDAC1 Histone deacetylase 1 (HDAC1) RPD3L1
Type:
Enzyme
Mol. Mass.:
55090.27
Organism:
Homo sapiens (Human)
Description:
Q13547
Residue:
482
  
Inhibitor
Name:
BDBM50105684
Synonyms:
3-(4-Benzenesulfonylamino-phenyl)-N-hydroxy-propionamide N-hydroxy-3-(4-(phenylsulfonamido)phenyl)propanamide | US8796330, 38
Type:
Small organic molecule
Emp. Form.:
C15H16N2O4S
Mol. Mass.:
320.364
SMILES:
ONC(=O)CCc1ccc(NS(=O)(=O)c2ccccc2)cc1
: