Target
Histone deacetylase 1
Ligand
BDBM50105678
Substrate
Meas. Tech.
ChEMBL_205835 (CHEMBL810946)
EC50
5000±n/a nM
Citation
 Lavoie, RBouchain, GFrechette, SWoo, SHAbou-Khalil, ELeit, SFournel, MYan, PTTrachy-Bourget, MCBeaulieu, CLi, ZBesterman, JDelorme, D Design and synthesis of a novel class of histone deacetylase inhibitors. Bioorg Med Chem Lett 11:2847-50 (2001)  
Target
Name:
Histone deacetylase 1
Synonyms:
Cereblon/Histone deacetylase 1 HDAC1 Histone deacetylase 1 (HDAC1) RPD3L1
Type:
Enzyme
Mol. Mass.:
55090.27
Organism:
Homo sapiens (Human)
Description:
Q13547
Residue:
482
  
Inhibitor
Name:
BDBM50105678
Synonyms:
(E)-N-Hydroxy-3-[4-(4-methoxy-benzenesulfonylamino)-phenyl]-acrylamide N-Hydroxy-3-[4-(4-methoxy-benzenesulfonylamino)-phenyl]-acrylamide US8796330, 113
Type:
Small organic molecule
Emp. Form.:
C16H16N2O5S
Mol. Mass.:
348.374
SMILES:
COc1ccc(cc1)S(=O)(=O)Nc1ccc(\C=C\C(=O)NO)cc1
: