Target
Mitogen-activated protein kinase 14
Ligand
BDBM50105753
Substrate
Meas. Tech.
ChEBML_221157
IC50
33±n/a nM
Citation
 Adams, JLBoehm, JCGallagher, TFKassis, SWebb, EFHall, RSorenson, MGarigipati, RGriswold, DELee, JC Pyrimidinylimidazole inhibitors of p38: cyclic N-1 imidazole substituents enhance p38 kinase inhibition and oral activity. Bioorg Med Chem Lett 11:2867-70 (2001)  
Target
Name:
Mitogen-activated protein kinase 14
Synonyms:
CSAID-binding protein CSBP1 CSPB1 MAP kinase 14 MAP kinase p38 alpha MAPK14 MK14_HUMAN Mitogen-activated protein kinase p38 alpha Stress-activated protein kinase 2a | p38 MAP kinase alpha/beta
Type:
Serine/threonine-protein kinase
Mol. Mass.:
41286.76
Organism:
Homo sapiens (Human)
Description:
Q16539
Residue:
360
  
Inhibitor
Name:
BDBM50105753
Synonyms:
4-[5-(2-Amino-pyrimidin-4-yl)-4-(4-fluoro-phenyl)-imidazol-1-yl]-piperidine-1-carboxylic acid ethyl ester D3RKN_45
Type:
Small organic molecule
Emp. Form.:
C21H23FN6O2
Mol. Mass.:
410.4447
SMILES:
CCOC(=O)N1CCC(CC1)n1cnc(c1-c1ccnc(N)n1)-c1ccc(F)cc1
: