Target
Cytochrome P450 2C18
Ligand
BDBM50090669
Substrate
Meas. Tech.
ChEMBL_51520 (CHEMBL660380)
IC50
170000±n/a nM
Citation
 Ha-Duong, NTDijols, SMarques-Soares, CMinoletti, CDansette, PMMansuy, D Synthesis of sulfaphenazole derivatives and their use as inhibitors and tools for comparing the active sites of human liver cytochromes P450 of the 2C subfamily. J Med Chem 44:3622-31 (2001)  
Target
Name:
Cytochrome P450 2C18
Synonyms:
CP2CI_HUMAN CYPIIC18 | P450-6B/29C
Type:
PROTEIN
Mol. Mass.:
55714.53
Organism:
Homo sapiens (Human)
Description:
ChEMBL_51520
Residue:
490
  
Inhibitor
Name:
BDBM50090669
Synonyms:
4-Methyl-N-(2-phenyl-2H-pyrazol-3-yl)-benzenesulfonamide | CHEMBL432386
Type:
Small organic molecule
Emp. Form.:
C16H15N3O2S
Mol. Mass.:
313.374
SMILES:
Cc1ccc(cc1)S(=O)(=O)Nc1ccnn1-c1ccccc1
: