Target
Cytochrome P450 2C18
Ligand
BDBM50105828
Substrate
Meas. Tech.
ChEMBL_51520 (CHEMBL660380)
IC50
10000±n/a nM
Citation
 Ha-Duong, NTDijols, SMarques-Soares, CMinoletti, CDansette, PMMansuy, D Synthesis of sulfaphenazole derivatives and their use as inhibitors and tools for comparing the active sites of human liver cytochromes P450 of the 2C subfamily. J Med Chem 44:3622-31 (2001)  
Target
Name:
Cytochrome P450 2C18
Synonyms:
CP2CI_HUMAN CYPIIC18 | P450-6B/29C
Type:
PROTEIN
Mol. Mass.:
55714.53
Organism:
Homo sapiens (Human)
Description:
ChEMBL_51520
Residue:
490
  
Inhibitor
Name:
BDBM50105828
Synonyms:
4-Allyl-N-methyl-N-(2-phenyl-2H-pyrazol-3-yl)-benzenesulfonamide | CHEMBL333704
Type:
Small organic molecule
Emp. Form.:
C19H19N3O2S
Mol. Mass.:
353.438
SMILES:
CN(c1ccnn1-c1ccccc1)S(=O)(=O)c1ccc(CC=C)cc1
: