Target
Melanocortin receptor 3
Ligand
BDBM50105884
Substrate
Meas. Tech.
ChEMBL_220872 (CHEMBL824628)
Ki
1500±n/a nM
Citation
 Bednarek, MAMacNeil, TKalyani, RNTang, RVan der Ploeg, LHWeinberg, DH Selective, high affinity peptide antagonists of alpha-melanotropin action at human melanocortin receptor 4: their synthesis and biological evaluation in vitro. J Med Chem 44:3665-72 (2001)  
Target
Name:
Melanocortin receptor 3
Synonyms:
MC3-R MC3R_HUMAN Melanocortin receptor (M3 and M4)
Type:
Enzyme
Mol. Mass.:
36044.86
Organism:
Homo sapiens (Human)
Description:
P41968
Residue:
323
  
Inhibitor
Name:
BDBM50105884
Synonyms:
9-(3-Guanidino-propyl)-6-(1H-indol-3-ylmethyl)-12-naphthalen-2-ylmethyl-5,8,11,14,17-pentaoxo-1,4,7,10,13pentaaza-cycloheptadecane-3-carboxylic acid | CHEMBL331728
Type:
Small organic molecule
Emp. Form.:
C37H44N10O6
Mol. Mass.:
724.8087
SMILES:
NC(=N)NCCC[C@@H]1NC(=O)[C@H](Cc2ccc3ccccc3c2)NC(=O)CCC(=O)NCC(NC(=O)[C@@H](Cc2c[nH]c3ccccc23)NC1=O)C(N)=O
: