Target
Melanocortin receptor 5
Ligand
BDBM50105882
Substrate
Meas. Tech.
ChEMBL_220875 (CHEMBL824631)
EC50
73±n/a nM
Citation
 Bednarek, MAMacNeil, TKalyani, RNTang, RVan der Ploeg, LHWeinberg, DH Selective, high affinity peptide antagonists of alpha-melanotropin action at human melanocortin receptor 4: their synthesis and biological evaluation in vitro. J Med Chem 44:3665-72 (2001)  
Target
Name:
Melanocortin receptor 5
Synonyms:
MC-2 MC5R Melanocortin MC5 Melanocortin receptor 5 | Melanocortin receptor 5 (MC5R)
Type:
Enzyme
Mol. Mass.:
36612.92
Organism:
Homo sapiens (Human)
Description:
P33032
Residue:
325
  
Inhibitor
Name:
BDBM50105882
Synonyms:
CHEMBL2370533 | Cyclo Ac-Cys-Glu-His-D-Phe-(3,4-di-Cl)-Arg-Trp-Gly-Cys-Pro-Pro-Lys-Asp-NH2
Type:
Small organic molecule
Emp. Form.:
C66H89Cl2N19O16S2
Mol. Mass.:
1539.567
SMILES:
CC(=O)N[C@@H]1CSSC[C@H](NC(=O)CNC(=O)[C@@H](Cc2c[nH]c3ccccc23)NC(=O)[C@H](CCCN=C(N)N)NC(=O)[C@H](Cc2ccc(Cl)c(Cl)c2)NC(=O)[C@H](Cc2c[nH]cn2)NC(=O)[C@@H](CCC(O)=O)NC1=O)C(=O)N1CCC[C@H]1C(=O)N1CCC[C@H]1C(=O)[C@H](CCCCN)NC(=O)[C@@H](N)CC(O)=O
: