Target
Thrombopoietin receptor
Ligand
BDBM50105961
Substrate
Meas. Tech.
ChEMBL_207477 (CHEMBL815867)
EC50
300±n/a nM
Citation
 Duffy, KJDarcy, MGDelorme, EDillon, SBEppley, DFErickson-Miller, CGiampa, LHopson, CBHuang, YKeenan, RMLamb, PLeong, LLiu, NMiller, SGPrice, ATRosen, JShah, RShaw, TNSmith, HStark, KCTian, SSTyree, CWiggall, KJZhang, LLuengo, JI Hydrazinonaphthalene and azonaphthalene thrombopoietin mimics are nonpeptidyl promoters of megakaryocytopoiesis. J Med Chem 44:3730-45 (2001)  
Target
Name:
Thrombopoietin receptor
Synonyms:
C-mpl MPL TPO-R TPOR_HUMAN
Type:
PROTEIN
Mol. Mass.:
71243.48
Organism:
Homo sapiens (Human)
Description:
ChEMBL_535587
Residue:
635
  
Inhibitor
Name:
BDBM50105961
Synonyms:
3-Hydroxy-4-(2-hydroxy-7-methoxy-naphthalen-1-ylazo)-naphthalene-1-sulfonic acid | CHEMBL123373
Type:
Small organic molecule
Emp. Form.:
C21H16N2O6S
Mol. Mass.:
424.427
SMILES:
COc1ccc2ccc(O)c(N=Nc3c(O)cc(c4ccccc34)S(O)(=O)=O)c2c1
: