Target
Cathepsin K
Ligand
BDBM19807
Substrate
Meas. Tech.
ChEMBL_48345 (CHEMBL663334)
Ki
2±n/a nM
Citation
 Smith, RABhargava, ABrowe, CChen, JDumas, JHatoum-Mokdad, HRomero, R Discovery and parallel synthesis of a new class of cathepsin K inhibitors. Bioorg Med Chem Lett 11:2951-4 (2001)  
Target
Name:
Cathepsin K
Synonyms:
CATK_HUMAN CTSO Cathepsin O Cathepsin X
Type:
Enzyme
Mol. Mass.:
36975.68
Organism:
Homo sapiens (Human)
Description:
P43235
Residue:
329
  
Inhibitor
Name:
BDBM19807
Synonyms:
CHEMBL100563 pyrrolidinone analogue, 24
Type:
Small organic molecule
Emp. Form.:
C32H42N4O7
Mol. Mass.:
594.6985
SMILES:
CC(C)C[C@H](NC(=O)OCc1ccccc1)C(=O)NC1CN(CC1=O)C(=O)[C@H](CC(C)C)NC(=O)OCc1ccccc1
: