Target
Integrin alpha-4/beta-1
Ligand
BDBM50106083
Substrate
Meas. Tech.
ChEMBL_213394 (CHEMBL818052)
IC50
52±n/a nM
Citation
 Wattanasin, SWeidmann, BRoche, DMyers, SXing, AGuo, QSabio, Mvon Matt, PHugo, RMaida, SLake, PWeetall, M Design and synthesis of potent and selective inhibitors of integrin VLA-4. Bioorg Med Chem Lett 11:2955-8 (2001)  
Target
Name:
Integrin alpha-4/beta-1
Synonyms:
Fibronectin receptor beta/Integrin alpha-4 | Integrin alpha-4/beta-1
Type:
Mol. Mass.:
Description:
ASSAY_ID of EBI is 88912
Components:
This complex has 2 components.
Component 1
Name:
Integrin beta-1
Synonyms:
CD_antigen=CD29 Fibronectin receptor beta GPIIA ITGB1 MDF2 | MSK12
Type:
Enzyme
Mol. Mass.:
88400.38
Organism:
Homo sapiens (Human)
Description:
P05556
Residue:
798
  
Component 2
Name:
Integrin alpha-4
Synonyms:
CD49 antigen-like family member D CD49d antigen ITA4_HUMAN Integrin alpha-4 Integrin alpha-IV VLA-4 integrin alpha 4 precursor | integrin alpha-4 precursor
Type:
Membrane Protein
Mol. Mass.:
114897.35
Organism:
Homo sapiens (Human)
Description:
P13612
Residue:
1032
  
Inhibitor
Name:
BDBM50106083
Synonyms:
(S)-3-(4-Methoxy-phenyl)-3-[2-((3-methoxy-propyl)-{2-[4-(3-o-tolyl-ureido)-phenyl]-acetyl}-amino)-acetylamino]-propionic acid | CHEMBL327274
Type:
Small organic molecule
Emp. Form.:
C32H38N4O7
Mol. Mass.:
590.6667
SMILES:
COCCCN(CC(=O)N[C@@H](CC(O)=O)c1ccc(OC)cc1)C(=O)Cc1ccc(NC(=O)Nc2ccccc2C)cc1
: