Target
Potassium voltage-gated channel subfamily E/KQT member 1
Ligand
BDBM50106233
Substrate
Meas. Tech.
ChEMBL_158552 (CHEMBL768695)
IC50
200±n/a nM
Citation
 Gerlach, UBrendel, JLang, HJPaulus, EFWeidmann, KBrüggemann, ABusch, AESuessbrich, HBleich, MGreger, R Synthesis and activity of novel and selective I(Ks)-channel blockers. J Med Chem 44:3831-7 (2001)  
Target
Name:
Potassium voltage-gated channel subfamily E/KQT member 1
Synonyms:
Voltage-gated potassium channel beta subunit Mink/subunit Kv7.1 | Voltage-gated potassium channel, IKs; KCNQ1(Kv7.1)/KCNE1(MinK)
Type:
Mol. Mass.:
Description:
ASSAY_ID of EBI is 158552
Components:
This complex has 2 components.
Component 1
Name:
Potassium voltage-gated channel subfamily E member 1
Synonyms:
Delayed rectifier potassium channel subunit IsK KCNE1 KCNQ1(Kv7.1)/KCNE1(MinK) Voltage-gated potassium channel beta subunit Mink | Voltage-gated potassium channel, IKs
Type:
PROTEIN
Mol. Mass.:
14676.11
Organism:
Homo sapiens (Human)
Description:
ChEMBL_1456351
Residue:
129
  
Component 2
Name:
Potassium voltage-gated channel subfamily KQT member 1
Synonyms:
KCNA8 KCNQ (Kv7) potassium channel KCNQ1_HUMAN Voltage-gated potassium channel subunit Kv7.1 | Voltage-gated potassium channel subunit Kv7.1/Misshapen-like kinase 1
Type:
PROTEIN
Mol. Mass.:
74739.00
Organism:
Homo sapiens (Human)
Description:
ChEMBL_1454245
Residue:
676
  
Inhibitor
Name:
BDBM50106233
Synonyms:
CHEMBL124308 | N-(6-Benzyloxy-3-hydroxy-2,2-dimethyl-chroman-4-yl)-N-methyl-methanesulfonamide
Type:
Small organic molecule
Emp. Form.:
C20H25NO5S
Mol. Mass.:
391.481
SMILES:
CN(C1C(O)C(C)(C)Oc2ccc(OCc3ccccc3)cc12)S(C)(=O)=O
: