Target
Ras guanyl-releasing protein 3
Ligand
BDBM50106244
Substrate
Meas. Tech.
ChEMBL_165987 (CHEMBL771809)
Ki
42±n/a nM
Citation
 Shao, LLewin, NELorenzo, PSHu, ZEnyedy, IJGarfield, SHStone, JCMarner, FJBlumberg, PMWang, S Iridals are a novel class of ligands for phorbol ester receptors with modest selectivity for the RasGRP receptor subfamily. J Med Chem 44:3872-80 (2001)  
Target
Name:
Ras guanyl-releasing protein 3
Synonyms:
GRP3 KIAA0846 RASGRP3
Type:
PROTEIN
Mol. Mass.:
78335.20
Organism:
Homo sapiens (Human)
Description:
ChEMBL_1364407
Residue:
690
  
Inhibitor
Name:
BDBM50106244
Synonyms:
6-[9-[1-formyl-(Z)-ethylidene]-1,6-dihydroxy-10-(3-hydroxypropyl)-6-methyl-(5S,6S)-spiro[4.5]dec-2-yl]-2-(4-methyl-3-pentenyl)-(2Z,4E)-2,4,6-heptatrienyl acetate | CHEMBL123519
Type:
Small organic molecule
Emp. Form.:
C32H48O6
Mol. Mass.:
528.7199
SMILES:
[#6]\[#6](-[#6])=[#6]/[#6]-[#6]\[#6](-[#6]-[#8]-[#6](-[#6])=O)=[#6]\[#6]=[#6]\[#6](=[#6])-[#6@@H]-1-[#6]-[#6][C@@]2([#6@@H]-1-[#8])[#6@H](-[#6]-[#6]-[#6]-[#8])\[#6](-[#6]-[#6][C@]2([#6])[#8])=[#6](\[#6])-[#6]=O
: