Target
5-hydroxytryptamine receptor 5A
Ligand
BDBM50106251
Substrate
Meas. Tech.
ChEMBL_3597 (CHEMBL618082)
Ki
1200±n/a nM
Citation
 Russell, MGBaker, RJBarden, LBeer, MSBristow, LBroughton, HBKnowles, MMcAllister, GPatel, SCastro, JL N-Arylsulfonylindole derivatives as serotonin 5-HT(6) receptor ligands. J Med Chem 44:3881-95 (2001)  
Target
Name:
5-hydroxytryptamine receptor 5A
Synonyms:
5-HT-5A 5-hydroxytryptamine receptor 5A 5ht5a REC17 Serotonin receptor 5A
Type:
Enzyme Catalytic Domain
Mol. Mass.:
40684.21
Organism:
RAT
Description:
5-HT5a HTR5A RAT::P35364
Residue:
357
  
Inhibitor
Name:
BDBM50106251
Synonyms:
2-(1-Benzenesulfonyl-1H-indol-4-yl)-ethylamine | CHEMBL125745
Type:
Small organic molecule
Emp. Form.:
C16H16N2O2S
Mol. Mass.:
300.375
SMILES:
NCCc1cccc2n(ccc12)S(=O)(=O)c1ccccc1
: