Target
Endothelin-1 receptor
Ligand
BDBM50051007
Substrate
Meas. Tech.
ChEMBL_63220 (CHEMBL674072)
IC50
0.36±n/a nM
Citation
 Jae, HSWinn, Mvon Geldern, TWSorensen, BKChiou, WJNguyen, BMarsh, KCOpgenorth, TJ Pyrrolidine-3-carboxylic acids as endothelin antagonists. 5. Highly selective, potent, and orally active ET(A) antagonists. J Med Chem 44:3978-84 (2001)  
Target
Name:
Endothelin-1 receptor
Synonyms:
EDNRA_RAT Ednra Endothelin-1 receptor
Type:
Enzyme Catalytic Domain
Mol. Mass.:
48256.91
Organism:
RAT
Description:
ENDOTHELIN A EDNRA RAT::P26684
Residue:
426
  
Inhibitor
Name:
BDBM50051007
Synonyms:
(2R,3R,4S)-4-Benzo[1,3]dioxol-5-yl-1-dibutylcarbamoylmethyl-2-(4-methoxy-phenyl)-pyrrolidine-3-carboxylic acid A-127722 | CHEMBL9194
Type:
Small organic molecule
Emp. Form.:
C29H38N2O6
Mol. Mass.:
510.6218
SMILES:
CCCCN(CCCC)C(=O)CN1C[C@@H]([C@H]([C@@H]1c1ccc(OC)cc1)C(O)=O)c1ccc2OCOc2c1
: