Target
Methylated-DNA--protein-cysteine methyltransferase
Ligand
BDBM50106515
Substrate
Meas. Tech.
ChEMBL_103719 (CHEMBL712287)
IC50
38±n/a nM
Citation
 Reinhard, JHull, WEvon der Lieth, CWEichhorn, UKliem, HCKaina, BWiessler, M Monosaccharide-linked inhibitors of O(6)-methylguanine-DNA methyltransferase (MGMT): synthesis, molecular modeling, and structure-activity relationships. J Med Chem 44:4050-61 (2001)  
Target
Name:
Methylated-DNA--protein-cysteine methyltransferase
Synonyms:
6-O-methylguanine-DNA methyltransferase MGMT_HUMAN
Type:
PROTEIN
Mol. Mass.:
21651.27
Organism:
Homo sapiens (Human)
Description:
ChEMBL_144711
Residue:
207
  
Inhibitor
Name:
BDBM50106515
Synonyms:
7-Benzyloxy-3H-[1,2,3]triazolo[4,5-d]pyrimidin-5-ylamine | CHEMBL333928
Type:
Small organic molecule
Emp. Form.:
C11H10N6O
Mol. Mass.:
242.2367
SMILES:
Nc1nc(OCc2ccccc2)c2[nH]nnc2n1
: