Target
Melanocyte-stimulating hormone receptor
Ligand
BDBM50106534
Substrate
Meas. Tech.
ChEMBL_106824 (CHEMBL717665)
EC50
5920±n/a nM
Citation
 Thirumoorthy, RHolder, JRBauzo, RMRichards, NGEdison, ASHaskell-Luevano, C Novel agouti-related-protein-based melanocortin-1 receptor antagonist. J Med Chem 44:4114-24 (2001)  
Target
Name:
Melanocyte-stimulating hormone receptor
Synonyms:
MC1-R Mc1r Melanocyte-stimulating hormone receptor | Msh-r
Type:
PROTEIN
Mol. Mass.:
35238.60
Organism:
Mus musculus
Description:
ChEMBL_1498846
Residue:
315
  
Inhibitor
Name:
BDBM50106534
Synonyms:
CHEMBL2370694 | Tyr-c[Glu-Arg-Phe-Phe-Asn-Ala-Phe-Dpr]-Tyr-NH2
Type:
Small organic molecule
Emp. Form.:
C66H82N16O14
Mol. Mass.:
1323.4561
SMILES:
[#6]-[#6@@H]-1-[#7]-[#6](=O)-[#6@H](-[#6]-[#6](-[#7])=O)-[#7]-[#6](=O)-[#6@H](-[#6]-c2ccccc2)-[#7]-[#6](=O)-[#6@H](-[#6]-c2ccccc2)-[#7]-[#6](=O)-[#6@H](-[#6]-[#6]-[#6]\[#7]=[#6](\[#7])-[#7])-[#7]-[#6](=O)-[#6@H](-[#6]-[#6]-[#6](=O)-[#7]-[#6]-[#6@H](-[#7]-[#6](=O)-[#6@H](-[#6]-c2ccccc2)-[#7]-[#6]-1=O)-[#6](=O)-[#7]-[#6@@H](-[#6]-c1ccc(-[#8])cc1)-[#6](-[#7])=O)-[#7]-[#6](=O)-[#6@@H](-[#7])-[#6]-c1ccc(-[#8])cc1
: