Target
Prostaglandin F2-alpha receptor
Ligand
BDBM50106549
Substrate
Meas. Tech.
ChEMBL_220868 (CHEMBL822980)
IC50
311±n/a nM
Citation
 Soper, DLMilbank, JBMieling, GEDirr, MJKende, ASCooper, RJee, WSYao, WChen, JLBodman, MLundy, MWDe, BStella, MEEbetino, FHWang, YdeLong, MAWos, JA Synthesis and biological evaluation of prostaglandin-F alkylphosphinic acid derivatives as bone anabolic agents for the treatment of osteoporosis. J Med Chem 44:4157-69 (2001)  
Target
Name:
Prostaglandin F2-alpha receptor
Synonyms:
PF2R_HUMAN PGF2 alpha receptor PTGFR Prostanoid FP receptor
Type:
Enzyme
Mol. Mass.:
40072.29
Organism:
Homo sapiens (Human)
Description:
P43088
Residue:
359
  
Inhibitor
Name:
BDBM50106549
Synonyms:
CHEMBL336781 | {6-[3,5-Dihydroxy-2-(3-hydroxy-oct-1-enyl)-cyclopentyl]-hex-4-enyl}-methyl-phosphinic acid
Type:
Small organic molecule
Emp. Form.:
C20H37O5P
Mol. Mass.:
388.4785
SMILES:
CCCCC[C@H](O)\C=C\[C@H]1[C@H](O)C[C@H](O)[C@@H]1CC=CCCCP(C)(O)=O
: