Target
Prostaglandin D2 receptor
Ligand
BDBM50106546
Substrate
Meas. Tech.
ChEMBL_158168 (CHEMBL766131)
IC50
>10000±n/a nM
Citation
 Soper, DLMilbank, JBMieling, GEDirr, MJKende, ASCooper, RJee, WSYao, WChen, JLBodman, MLundy, MWDe, BStella, MEEbetino, FHWang, YdeLong, MAWos, JA Synthesis and biological evaluation of prostaglandin-F alkylphosphinic acid derivatives as bone anabolic agents for the treatment of osteoporosis. J Med Chem 44:4157-69 (2001)  
Target
Name:
Prostaglandin D2 receptor
Synonyms:
PD2R_HUMAN Prostaglandin D2 Prostanoid DP receptor
Type:
Enzyme
Mol. Mass.:
40288.87
Organism:
Homo sapiens (Human)
Description:
Q13258
Residue:
359
  
Inhibitor
Name:
BDBM50106546
Synonyms:
CHEMBL134546 | {6-[3,5-Dihydroxy-2-(3-hydroxy-oct-1-enyl)-cyclopentyl]-hex-4-enyl}-phosphinic acid
Type:
Small organic molecule
Emp. Form.:
C19H35O5P
Mol. Mass.:
374.452
SMILES:
CCCCC[C@H](O)\C=C\[C@H]1[C@H](O)C[C@H](O)[C@@H]1CC=CCCCP(O)=O
: