Target
Sodium channel protein type 5 subunit alpha
Ligand
BDBM50107025
Substrate
Meas. Tech.
ChEBML_46176
IC50
5750±n/a nM
Citation
 Padmanabhan, SLavin, RCThakker, PMGuo, JZhang, LMoore, DPerlman, MEKirk, CDaly, DBurke-Howie, KJWolcott, TChari, SBerlove, DFischer, JBHolt, WFDurant, GJMcBurney, RN Solution-phase, parallel synthesis and pharmacological evaluation of acylguanidine derivatives as potential sodium channel blockers. Bioorg Med Chem Lett 11:3151-5 (2001)  
Target
Name:
Sodium channel protein type 5 subunit alpha
Synonyms:
HH1 SCN5A_HUMAN Sodium channel protein type 5 subunit alpha/beta-1/beta-2 Voltage-gated sodium channel subunit alpha Nav1.5
Type:
Enzyme
Mol. Mass.:
226908.60
Organism:
Homo sapiens (Human)
Description:
Q14524
Residue:
2016
  
Inhibitor
Name:
BDBM50107025
Synonyms:
CHEMBL106351 | N-(4-Isopropoxy-phenyl)-N'-(4-methyl-benzoyl)-guanidine
Type:
Small organic molecule
Emp. Form.:
C18H21N3O2
Mol. Mass.:
311.3782
SMILES:
CC(C)Oc1ccc(cc1)N=C(N)NC(=O)c1ccc(C)cc1
: