Target
Sodium channel protein type 2 subunit alpha
Ligand
BDBM50107040
Substrate
Meas. Tech.
ChEBML_223230
IC50
5030±n/a nM
Citation
 Padmanabhan, SLavin, RCThakker, PMGuo, JZhang, LMoore, DPerlman, MEKirk, CDaly, DBurke-Howie, KJWolcott, TChari, SBerlove, DFischer, JBHolt, WFDurant, GJMcBurney, RN Solution-phase, parallel synthesis and pharmacological evaluation of acylguanidine derivatives as potential sodium channel blockers. Bioorg Med Chem Lett 11:3151-5 (2001)  
Target
Name:
Sodium channel protein type 2 subunit alpha
Synonyms:
HBSC II SCN2A SCN2A2 Sodium (Site 2) Sodium channel protein type 2 alpha subunit Voltage-gated sodium channel subunit alpha Nav1.2
Type:
Enzyme
Mol. Mass.:
227954.68
Organism:
Homo sapiens (Human)
Description:
Q99250
Residue:
2005
  
Inhibitor
Name:
BDBM50107040
Synonyms:
CHEMBL110352 | N-(2,6-Dichloro-benzoyl)-N'-(4-phenyl-butyl)-guanidine
Type:
Small organic molecule
Emp. Form.:
C18H19Cl2N3O
Mol. Mass.:
364.269
SMILES:
NC(NC(=O)c1c(Cl)cccc1Cl)=NCCCCc1ccccc1
: