Target
Sodium channel protein type 5 subunit alpha
Ligand
BDBM50107045
Substrate
Meas. Tech.
ChEBML_46176
IC50
1760±n/a nM
Citation
 Padmanabhan, SLavin, RCThakker, PMGuo, JZhang, LMoore, DPerlman, MEKirk, CDaly, DBurke-Howie, KJWolcott, TChari, SBerlove, DFischer, JBHolt, WFDurant, GJMcBurney, RN Solution-phase, parallel synthesis and pharmacological evaluation of acylguanidine derivatives as potential sodium channel blockers. Bioorg Med Chem Lett 11:3151-5 (2001)  
Target
Name:
Sodium channel protein type 5 subunit alpha
Synonyms:
HH1 SCN5A_HUMAN Sodium channel protein type 5 subunit alpha/beta-1/beta-2 Voltage-gated sodium channel subunit alpha Nav1.5
Type:
Enzyme
Mol. Mass.:
226908.60
Organism:
Homo sapiens (Human)
Description:
Q14524
Residue:
2016
  
Inhibitor
Name:
BDBM50107045
Synonyms:
CHEMBL421032 | N-[2-(5-Methoxy-1H-indol-3-yl)-ethyl]-N'-(4-methyl-benzoyl)-guanidine
Type:
Small organic molecule
Emp. Form.:
C20H22N4O2
Mol. Mass.:
350.4143
SMILES:
COc1ccc2[nH]cc(CCN=C(N)NC(=O)c3ccc(C)cc3)c2c1
: