Target
Sodium channel protein type 2 subunit alpha
Ligand
BDBM50107045
Substrate
Meas. Tech.
ChEBML_223230
IC50
1760±n/a nM
Citation
 Padmanabhan, SLavin, RCThakker, PMGuo, JZhang, LMoore, DPerlman, MEKirk, CDaly, DBurke-Howie, KJWolcott, TChari, SBerlove, DFischer, JBHolt, WFDurant, GJMcBurney, RN Solution-phase, parallel synthesis and pharmacological evaluation of acylguanidine derivatives as potential sodium channel blockers. Bioorg Med Chem Lett 11:3151-5 (2001)  
Target
Name:
Sodium channel protein type 2 subunit alpha
Synonyms:
HBSC II SCN2A SCN2A2 Sodium (Site 2) Sodium channel protein type 2 alpha subunit Voltage-gated sodium channel subunit alpha Nav1.2
Type:
Enzyme
Mol. Mass.:
227954.68
Organism:
Homo sapiens (Human)
Description:
Q99250
Residue:
2005
  
Inhibitor
Name:
BDBM50107045
Synonyms:
CHEMBL421032 | N-[2-(5-Methoxy-1H-indol-3-yl)-ethyl]-N'-(4-methyl-benzoyl)-guanidine
Type:
Small organic molecule
Emp. Form.:
C20H22N4O2
Mol. Mass.:
350.4143
SMILES:
COc1ccc2[nH]cc(CCN=C(N)NC(=O)c3ccc(C)cc3)c2c1
: