Target
Endothelin-1 receptor
Ligand
BDBM50107554
Substrate
Meas. Tech.
ChEBML_65801
IC50
1.1±n/a nM
Citation
 Morimoto, HShimadzu, HHosaka, TKawase, YYasuda, KKikkawa, KYamauchi-Kohno, RYamada, K Modifications and structure-activity relationships at the 2-position of 4-sulfonamidopyrimidine derivatives as potent endothelin antagonists. Bioorg Med Chem Lett 12:81-4 (2001)  
Target
Name:
Endothelin-1 receptor
Synonyms:
EDNRA Endothelin receptor ET-A
Type:
PROTEIN
Mol. Mass.:
48707.29
Organism:
Sus scrofa
Description:
ChEMBL_65803
Residue:
427
  
Inhibitor
Name:
BDBM50107554
Synonyms:
CHEMBL424358 | N-{6-[2-(5-Bromo-pyrimidin-2-yloxy)-ethoxy]-2-isopropyl-5-p-tolyl-pyrimidin-4-yl}-4-tert-butyl-benzenesulfonamide
Type:
Small organic molecule
Emp. Form.:
C30H34BrN5O4S
Mol. Mass.:
640.591
SMILES:
CC(C)c1nc(NS(=O)(=O)c2ccc(cc2)C(C)(C)C)c(c(OCCOc2ncc(Br)cn2)n1)-c1ccc(C)cc1
: