Target
Endothelin-1 receptor
Ligand
BDBM50107562
Substrate
Meas. Tech.
ChEBML_65801
IC50
0.002500±n/a nM
Citation
 Morimoto, HShimadzu, HHosaka, TKawase, YYasuda, KKikkawa, KYamauchi-Kohno, RYamada, K Modifications and structure-activity relationships at the 2-position of 4-sulfonamidopyrimidine derivatives as potent endothelin antagonists. Bioorg Med Chem Lett 12:81-4 (2001)  
Target
Name:
Endothelin-1 receptor
Synonyms:
EDNRA Endothelin receptor ET-A
Type:
PROTEIN
Mol. Mass.:
48707.29
Organism:
Sus scrofa
Description:
ChEMBL_65803
Residue:
427
  
Inhibitor
Name:
BDBM50107562
Synonyms:
CHEMBL168119 | N-[6-[2-(5-Bromo-pyrimidin-2-yloxy)-ethoxy]-2-(4-hydroxy-piperidin-1-yl)-5-(2-methoxy-phenoxy)-pyrimidin-4-yl]-4-tert-butyl-benzenesulfonamide
Type:
Small organic molecule
Emp. Form.:
C32H37BrN6O7S
Mol. Mass.:
729.641
SMILES:
COc1ccccc1Oc1c(NS(=O)(=O)c2ccc(cc2)C(C)(C)C)nc(nc1OCCOc1ncc(Br)cn1)N1CCC(O)CC1
: