Target
Interstitial collagenase
Ligand
BDBM50107580
Substrate
Meas. Tech.
ChEBML_106318
Ki
>5000±n/a nM
Citation
 Yao, WChao, MWasserman, ZRLiu, RQCovington, MBNewton, RChrist, DWexler, RRDecicco, CP Potent P1' biphenylmethyl substituted aggrecanase inhibitors. Bioorg Med Chem Lett 12:101-4 (2001)  
Target
Name:
Interstitial collagenase
Synonyms:
CLG MMP1 Matrix metalloproteinase-1 | Matrix metalloproteinase-1 (MMP-1)
Type:
Enzyme
Mol. Mass.:
54010.26
Organism:
Homo sapiens (Human)
Description:
P03956
Residue:
469
  
Inhibitor
Name:
BDBM50107580
Synonyms:
(R)-N*4*-Hydroxy-N*1*-((1S,2R)-2-hydroxy-indan-1-yl)-2-(3'-isopropyl-biphenyl-4-ylmethyl)-succinamide | CHEMBL268381
Type:
Small organic molecule
Emp. Form.:
C29H32N2O4
Mol. Mass.:
472.5754
SMILES:
CC(C)c1cccc(c1)-c1ccc(C[C@H](CC(=O)NO)C(=O)N[C@@H]2[C@H](O)Cc3ccccc23)cc1
: