Target
Glutamate receptor 1
Ligand
BDBM50107595
Substrate
Meas. Tech.
ChEMBL_90148 (CHEMBL701246)
Ki
109±n/a nM
Citation
 Campiani, GMorelli, ENacci, VFattorusso, CRamunno, ANovellino, EGreenwood, JLiljefors, TGriffiths, RSinclair, CReavy, HKristensen, ASPickering, DSSchousboe, ACagnotto, AFumagalli, EMennini, T Characterization of the 1H-cyclopentapyrimidine-2,4(1H,3H)-dione derivative (S)-CPW399 as a novel, potent, and subtype-selective AMPA receptor full agonist with partial desensitization properties. J Med Chem 44:4501-4 (2001)  
Target
Name:
Glutamate receptor 1
Synonyms:
GRIA1_MOUSE Glutamate receptor ionotropic, AMPA Gria1
Type:
PROTEIN
Mol. Mass.:
101574.96
Organism:
Mus musculus
Description:
ChEMBL_90145
Residue:
907
  
Inhibitor
Name:
BDBM50107595
Synonyms:
(S)-1-(2-Amino-2-carboxyethyl)-6,7-dihydro-1H-cyclopenta[d]-pyrimidin-2,4(1H,3H)dione 2-Amino-3-(2,4-dioxo-2,3,4,5,6,7-hexahydro-cyclopentapyrimidin-1-yl)-propionic acid | CHEMBL337577
Type:
Small organic molecule
Emp. Form.:
C10H13N3O4
Mol. Mass.:
239.2279
SMILES:
N[C@@H](Cn1c2CCCc2c(=O)[nH]c1=O)C(O)=O
: