Target
Apolipoprotein B-100
Ligand
BDBM50107773
Substrate
Meas. Tech.
ChEMBL_217986 (CHEMBL824105)
IC50
5±n/a nM
Citation
 Ksander, GMdeJesus, RYuan, AFink, CMoskal, MCarlson, EKukkola, PBilci, NWallace, ENeubert, AFeldman, DMogelesky, TPoirier, KJeune, MSteele, RWasvery, JStephan, ZCahill, EWebb, RNavarrete, ALee, WGibson, JAlexander, NSharif, HHospattankar, A Diaminoindanes as microsomal triglyceride transfer protein inhibitors. J Med Chem 44:4677-87 (2001)  
Target
Name:
Apolipoprotein B-100
Synonyms:
APOB Apo B-100 Apolipoprotein B-100 | Apolipoprotein B-48
Type:
PROTEIN
Mol. Mass.:
515630.53
Organism:
Homo sapiens (Human)
Description:
ChEMBL_217986
Residue:
4563
  
Inhibitor
Name:
BDBM50107773
Synonyms:
4'-Chloro-6-methyl-biphenyl-2-carboxylic acid (7-methanesulfonylamino-6,7,8,9-tetrahydro-5H-benzocyclohepten-2-yl)-amide | CHEMBL141014
Type:
Small organic molecule
Emp. Form.:
C26H27ClN2O3S
Mol. Mass.:
483.022
SMILES:
Cc1cccc(C(=O)Nc2ccc3CCC(CCc3c2)NS(C)(=O)=O)c1-c1ccc(Cl)cc1
: