Target
Matrix metalloproteinase-9
Ligand
BDBM50108132
Substrate
Meas. Tech.
ChEMBL_105522 (CHEMBL715231)
IC50
0.910000±n/a nM
Citation
 Wada, CKHolms, JHCurtin, MLDai, YFlorjancic, ASGarland, RBGuo, YHeyman, HRStacey, JRSteinman, DHAlbert, DHBouska, JJElmore, INGoodfellow, CLMarcotte, PATapang, PMorgan, DWMichaelides, MRDavidsen, SK Phenoxyphenyl sulfone N-formylhydroxylamines (retrohydroxamates) as potent, selective, orally bioavailable matrix metalloproteinase inhibitors. J Med Chem 45:219-32 (2001)  
Target
Name:
Matrix metalloproteinase-9
Synonyms:
67 kDa matrix metalloproteinase-9 92 kDa gelatinase CLG4B Gelatinase B MMP9 Matrix metalloproteinase 9 (MMP-9) Matrix metalloproteinase-9 (MMP9)
Type:
Enzyme
Mol. Mass.:
78452.28
Organism:
Homo sapiens (Human)
Description:
P14780
Residue:
707
  
Inhibitor
Name:
BDBM50108132
Synonyms:
CHEMBL75487 | N-[2-(3'-Cyanomethyl-biphenyl-4-sulfonyl)-1-(4,4-dimethyl-2,5-dioxo-imidazolidin-1-ylmethyl)-ethyl]-N-hydroxy-formamide
Type:
Small organic molecule
Emp. Form.:
C23H24N4O6S
Mol. Mass.:
484.525
SMILES:
CC1(C)NC(=O)N(CC(CS(=O)(=O)c2ccc(cc2)-c2cccc(CC#N)c2)N(O)C=O)C1=O
: