Target
Matrix metalloproteinase-9
Ligand
BDBM50108143
Substrate
Meas. Tech.
ChEMBL_105522 (CHEMBL715231)
IC50
0.530000±n/a nM
Citation
 Wada, CKHolms, JHCurtin, MLDai, YFlorjancic, ASGarland, RBGuo, YHeyman, HRStacey, JRSteinman, DHAlbert, DHBouska, JJElmore, INGoodfellow, CLMarcotte, PATapang, PMorgan, DWMichaelides, MRDavidsen, SK Phenoxyphenyl sulfone N-formylhydroxylamines (retrohydroxamates) as potent, selective, orally bioavailable matrix metalloproteinase inhibitors. J Med Chem 45:219-32 (2001)  
Target
Name:
Matrix metalloproteinase-9
Synonyms:
67 kDa matrix metalloproteinase-9 92 kDa gelatinase CLG4B Gelatinase B MMP9 Matrix metalloproteinase 9 (MMP-9) Matrix metalloproteinase-9 (MMP9)
Type:
Enzyme
Mol. Mass.:
78452.28
Organism:
Homo sapiens (Human)
Description:
P14780
Residue:
707
  
Inhibitor
Name:
BDBM50108143
Synonyms:
4-{3-(Formyl-hydroxy-amino)-4-[4-(4-trifluoromethoxy-phenoxy)-benzenesulfonyl]-butyl}-benzoic acid | CHEMBL78145
Type:
Small organic molecule
Emp. Form.:
C25H22F3NO8S
Mol. Mass.:
553.504
SMILES:
ON(C=O)C(CCc1ccc(cc1)C(O)=O)CS(=O)(=O)c1ccc(Oc2ccc(OC(F)(F)F)cc2)cc1
: