Target
Stromelysin-1
Ligand
BDBM50084661
Substrate
Meas. Tech.
ChEMBL_104893 (CHEMBL715751)
IC50
134±n/a nM
Citation
 Wada, CKHolms, JHCurtin, MLDai, YFlorjancic, ASGarland, RBGuo, YHeyman, HRStacey, JRSteinman, DHAlbert, DHBouska, JJElmore, INGoodfellow, CLMarcotte, PATapang, PMorgan, DWMichaelides, MRDavidsen, SK Phenoxyphenyl sulfone N-formylhydroxylamines (retrohydroxamates) as potent, selective, orally bioavailable matrix metalloproteinase inhibitors. J Med Chem 45:219-32 (2001)  
Target
Name:
Stromelysin-1
Synonyms:
MMP-3 MMP3_HUMAN Matrix metalloproteinase 3 Matrix metalloproteinase-3 (MMP-3) SL-1 Stromelysin 1 | Transin-1
Type:
Enzyme
Mol. Mass.:
53973.13
Organism:
Homo sapiens (Human)
Description:
P08254
Residue:
477
  
Inhibitor
Name:
BDBM50084661
Synonyms:
4-(4'-Chloro-biphenyl-4-yl)-4-oxo-2-phenylsulfanylmethyl-butyric acid(Bay-12-9566) Tanomastat
Type:
Small organic molecule
Emp. Form.:
C23H19ClO3S
Mol. Mass.:
410.913
SMILES:
OC(=O)[C@@H](CSc1ccccc1)CC(=O)c1ccc(cc1)-c1ccc(Cl)cc1
: