Target
72 kDa type IV collagenase
Ligand
BDBM50108154
Substrate
Meas. Tech.
ChEMBL_104551 (CHEMBL718937)
IC50
2.4±n/a nM
Citation
 Wada, CKHolms, JHCurtin, MLDai, YFlorjancic, ASGarland, RBGuo, YHeyman, HRStacey, JRSteinman, DHAlbert, DHBouska, JJElmore, INGoodfellow, CLMarcotte, PATapang, PMorgan, DWMichaelides, MRDavidsen, SK Phenoxyphenyl sulfone N-formylhydroxylamines (retrohydroxamates) as potent, selective, orally bioavailable matrix metalloproteinase inhibitors. J Med Chem 45:219-32 (2001)  
Target
Name:
72 kDa type IV collagenase
Synonyms:
72 kDa gelatinase CLG4A Gelatinase A (MMP-2) MMP2_HUMAN Matrix metalloproteinase-2 (MMP 2) Matrix metalloproteinases 2 (MMP-2) | TBE-1
Type:
Enzyme
Mol. Mass.:
73870.36
Organism:
Homo sapiens (Human)
Description:
P08253
Residue:
660
  
Inhibitor
Name:
BDBM50108154
Synonyms:
CHEMBL75618 | N-[2-(4'-Butoxy-biphenyl-4-sulfonyl)-1-(4,4-dimethyl-2,5-dioxo-imidazolidin-1-ylmethyl)-ethyl]-N-hydroxy-formamide
Type:
Small organic molecule
Emp. Form.:
C25H31N3O7S
Mol. Mass.:
517.595
SMILES:
CCCCOc1ccc(cc1)-c1ccc(cc1)S(=O)(=O)CC(CN1C(=O)NC(C)(C)C1=O)N(O)C=O
: