Target
Interstitial collagenase
Ligand
BDBM50108166
Substrate
Meas. Tech.
ChEMBL_106297 (CHEMBL714553)
IC50
82±n/a nM
Citation
 Wada, CKHolms, JHCurtin, MLDai, YFlorjancic, ASGarland, RBGuo, YHeyman, HRStacey, JRSteinman, DHAlbert, DHBouska, JJElmore, INGoodfellow, CLMarcotte, PATapang, PMorgan, DWMichaelides, MRDavidsen, SK Phenoxyphenyl sulfone N-formylhydroxylamines (retrohydroxamates) as potent, selective, orally bioavailable matrix metalloproteinase inhibitors. J Med Chem 45:219-32 (2001)  
Target
Name:
Interstitial collagenase
Synonyms:
CLG MMP1 Matrix metalloproteinase-1 | Matrix metalloproteinase-1 (MMP-1)
Type:
Enzyme
Mol. Mass.:
54010.26
Organism:
Homo sapiens (Human)
Description:
P03956
Residue:
469
  
Inhibitor
Name:
BDBM50108166
Synonyms:
CHEMBL76043 | N-[1-(5,5-Dimethyl-2,4-dioxo-imidazolidin-1-ylmethyl)-2-(4'-trifluoromethoxy-biphenyl-4-sulfonyl)-ethyl]-N-hydroxy-formamide
Type:
Small organic molecule
Emp. Form.:
C22H22F3N3O7S
Mol. Mass.:
529.486
SMILES:
CC1(C)N(CC(CS(=O)(=O)c2ccc(cc2)-c2ccc(OC(F)(F)F)cc2)N(O)C=O)C(=O)NC1=O
: