Target
Substance-K receptor
Ligand
BDBM50108243
Substrate
Meas. Tech.
ChEBML_209195
Ki
14±n/a nM
Citation
 Shih, NYAlbanese, MAnthes, JCCarruthers, NIGrice, CALin, LMangiaracina, PReichard, GASchwerdt, JSeidl, VWong, SCPiwinski, JJ Synthesis and structure-activity relationships of oxime neurokinin antagonists: discovery of potent arylamides. Bioorg Med Chem Lett 12:141-5 (2001)  
Target
Name:
Substance-K receptor
Synonyms:
NK-2 receptor NK2R NKNAR Neurokinin A receptor Neurokinin-2 (NK-2) SKR TACR2 Tachykinin receptor 2 (NK2) | hnk-3
Type:
Protein
Mol. Mass.:
44455.78
Organism:
Homo sapiens (Human)
Description:
P21452
Residue:
398
  
Inhibitor
Name:
BDBM50108243
Synonyms:
3-(3,4-Dichloro-phenyl)-5-(4-hydroxy-4-phenyl-piperidin-1-yl)-1-(3-methyl-benzyloxy)-pentan-2-one O-methyl-oxime | CHEMBL32477
Type:
Small organic molecule
Emp. Form.:
C31H36Cl2N2O3
Mol. Mass.:
555.535
SMILES:
CO\N=C(/COCc1cccc(C)c1)C(CCN1CCC(O)(CC1)c1ccccc1)c1ccc(Cl)c(Cl)c1
: