Target
Substance-P receptor
Ligand
BDBM50108269
Substrate
Meas. Tech.
ChEBML_205884
Ki
53±n/a nM
Citation
 Shih, NYAlbanese, MAnthes, JCCarruthers, NIGrice, CALin, LMangiaracina, PReichard, GASchwerdt, JSeidl, VWong, SCPiwinski, JJ Synthesis and structure-activity relationships of oxime neurokinin antagonists: discovery of potent arylamides. Bioorg Med Chem Lett 12:141-5 (2001)  
Target
Name:
Substance-P receptor
Synonyms:
NK-1 receptor NK1 Receptor NK1R_HUMAN Neurokinin-1 (NK-1) SPR TACR1 Tachykinin receptor 1 (NK1) | tachykinin
Type:
G Protein-Coupled Receptor (GPCR)
Mol. Mass.:
46254.43
Organism:
Homo sapiens (Human)
Description:
P25103
Residue:
407
  
Inhibitor
Name:
BDBM50108269
Synonyms:
3-(3,4-Dichloro-phenyl)-5-(4-hydroxy-4-phenyl-piperidin-1-yl)-1-(3,4,5-trimethoxy-benzyloxy)-pentan-2-one O-methyl-oxime | CHEMBL284269
Type:
Small organic molecule
Emp. Form.:
C33H40Cl2N2O6
Mol. Mass.:
631.587
SMILES:
CO\N=C(/COCc1cc(OC)c(OC)c(OC)c1)C(CCN1CCC(O)(CC1)c1ccccc1)c1ccc(Cl)c(Cl)c1
: