Target
Substance-P receptor
Ligand
BDBM50108274
Substrate
Meas. Tech.
ChEBML_205884
Ki
435±n/a nM
Citation
 Shih, NYAlbanese, MAnthes, JCCarruthers, NIGrice, CALin, LMangiaracina, PReichard, GASchwerdt, JSeidl, VWong, SCPiwinski, JJ Synthesis and structure-activity relationships of oxime neurokinin antagonists: discovery of potent arylamides. Bioorg Med Chem Lett 12:141-5 (2001)  
Target
Name:
Substance-P receptor
Synonyms:
NK-1 receptor NK1 Receptor NK1R_HUMAN Neurokinin-1 (NK-1) SPR TACR1 Tachykinin receptor 1 (NK1) | tachykinin
Type:
G Protein-Coupled Receptor (GPCR)
Mol. Mass.:
46254.43
Organism:
Homo sapiens (Human)
Description:
P25103
Residue:
407
  
Inhibitor
Name:
BDBM50108274
Synonyms:
CHEMBL33194 | N-{3-(3,4-Dichloro-phenyl)-5-(4-hydroxy-4-phenyl-piperidin-1-yl)-2-[(Z)-methoxyimino]-pentyl}-N-methyl-3,5-bis-trifluoromethyl-benzenesulfonamide
Type:
Small organic molecule
Emp. Form.:
C32H33Cl2F6N3O4S
Mol. Mass.:
740.584
SMILES:
CO\N=C(/CN(C)S(=O)(=O)c1cc(cc(c1)C(F)(F)F)C(F)(F)F)C(CCN1CCC(O)(CC1)c1ccccc1)c1ccc(Cl)c(Cl)c1
: